{"text_format":"3","workbook":"xlsx","n_sheets":21,"sheets":["BIODATA","ACCOUNT","1. TB","2.SJ","3.CRJ","4.PJ","5.CPJ","6.GJ","7.PCJ","GENERAL LEDGER","UTB","7.ADJ","WS","8.IS","9.K-F","10. IS-FISCAL","9.SE","10. FPR","11.CF","12. CLOSING","13. POST CLOSING TB"],"not_rendered":{"images":2,"defined_names":22},"read":"whole","date_system":"1900"}

{"sheet":"BIODATA","index":0,"n_rows":16,"n_cols":7,"rows_kept":16,"merged":[[1,1,1,12],[2,1,2,12],[3,1,3,12],[4,1,4,12],[5,1,5,12],[7,4,7,11],[9,7,9,9],[11,4,11,11],[15,4,15,11]]}
[]
[null,"BIODATA PERSERTA "]
[null,"UJI KOMPETENSI KEJURUAN (UKK)"]
[null,"BIDANG KEAHLIAN AKUNTANSI"]
[null,"SEKOLAH MENENGAH KEJURUAN (SMK)"]
[null,"TAHUN AJARAN 2021 / 2022"]
[]
[null,null,"NAMA LENGKAP",":"]
[]
[null,null,"KELAS / NO. ABSEN",":",null,null," /"]
{"$rows_left_out":7}
{"sheet":"ACCOUNT","index":1,"n_rows":70,"n_cols":4,"rows_kept":70,"merged":[[1,1,1,3],[2,1,2,3]]}
[]
[null,"PT YESCOM PRATAMA"]
[null,"CHART OF ACCOUNT"]
[]
[null,"NOMOR","NAMA AKUN","FUNGSI UNTUK MENCATAT MUTASI NILAI:"]
[null,null,"Current Assets :"]
[null,"1-1110","Cash In Bank","Kas di Bank"]
[null,"1-1120","Petty Cash","Kas Kecil"]
[null,"1-1130","ShopeePay Cash","Kas di ShopeePay"]
[null,"1-1140","Cash In Dana App.","Kas di Aplikasi Dana"]
{"$rows_left_out":61}
{"sheet":"1. TB","index":2,"n_rows":66,"n_cols":5,"rows_kept":66,"merged":[[1,1,1,4],[2,1,2,4],[3,1,3,4],[4,1,4,4],[5,1,5,4],[62,1,62,2]]}
[]
[null,{"$f":"ACCOUNT!B2","v":"PT YESCOM PRATAMA"}]
[null,"TRIAL BALANCE"]
[null,"November 30, 2020"]
[null,"(in rupiahs)"]
[]
[null,"Acc. Num.","Acc. Name","Debet","Credit"]
[null,"1-1110",{"$f":"VLOOKUP(B8,ACCOUNT!$B$6:$D$70,2,0)","v":"Cash In Bank"}]
[null,"1-1120",{"$f":"VLOOKUP(B9,ACCOUNT!$B$6:$D$70,2,0)","v":"Petty Cash"}]
[null,"1-1130",{"$f":"VLOOKUP(B10,ACCOUNT!$B$6:$D$70,2,0)","v":"ShopeePay Cash"}]
{"$rows_left_out":57}
{"sheet":"2.SJ","index":3,"n_rows":19,"n_cols":5,"rows_kept":19,"merged":[[1,1,1,4],[2,1,2,4],[3,1,3,4],[4,1,4,4],[5,1,5,4],[6,1,6,4],[7,1,7,2],[7,3,7,4]]}
[]
[null,{"$f":"ACCOUNT!B2","v":"PT YESCOM PRATAMA"}]
[null,"RECAPITULATION OF SALES JOURNAL"]
[null,"Month : December 2020"]
[null,"(in rupiahs)"]
[]
[null,"RECAPITULATION"]
[null,"DEBIT",null,"CREDIT"]
[null,"Account. No.","Amount","Account. No.","Amount"]
[]
{"$rows_left_out":10}
{"sheet":"3.CRJ","index":4,"n_rows":19,"n_cols":5,"rows_kept":19,"merged":[[0,1,0,4],[1,1,1,4],[2,1,2,4],[3,1,3,4],[4,1,4,4],[6,1,6,4],[7,1,7,2],[7,3,7,4]]}
[]
[null,{"$f":"'2.SJ'!B2:E2","v":"PT YESCOM PRATAMA"}]
[null,"RECAPITULATION OF CASH RECEIPT JOURNAL"]
[null,"Month : December 2020"]
[null,"(in rupiahs)"]
[]
[null,"RECAPITULATION"]
[null,"DEBIT",null,"CREDIT"]
[null,"Acc. No.","Amount","Acc. No.","Amount"]
[]
{"$rows_left_out":10}
{"sheet":"4.PJ","index":5,"n_rows":19,"n_cols":5,"rows_kept":19,"merged":[[0,1,0,4],[1,1,1,4],[2,1,2,4],[3,1,3,4],[4,1,4,4],[7,1,7,4],[8,1,8,2],[8,3,8,4]]}
[]
[null,{"$f":"'3.CRJ'!B2:E2","v":"PT YESCOM PRATAMA"}]
[null,"RECAPITULATION OF PURCHASE JOURNAL"]
[null,"Month : December 2020"]
[null,"(in rupiahs)"]
[]
[]
[null,"RECAPITULATION"]
[null,"DEBIT",null,"CREDIT"]
[null,"Acc. No.","Amount","Acc. No.","Amount"]
{"$rows_left_out":10}
{"sheet":"5.CPJ","index":6,"n_rows":24,"n_cols":5,"rows_kept":24,"merged":[[0,1,0,4],[1,1,1,4],[2,1,2,4],[3,1,3,4],[4,1,4,4],[6,1,6,4],[7,1,7,2],[7,3,7,4]]}
[]
[null,{"$f":"'4.PJ'!B2:E2","v":"PT YESCOM PRATAMA"}]
[null,"RECAPITULATION OF CASH PAYMENT JOURNAL"]
[null,"Month : December 2020"]
[null,"(in rupiahs)"]
[]
[null,"RECAPITULATION"]
[null,"DEBIT",null,"CREDIT"]
[null,"Acc. No.","Amount","Acc. No.","Amount"]
{"$rows_empty":10}
{"$rows_left_out":6}
{"sheet":"6.GJ","index":7,"n_rows":16,"n_cols":5,"rows_kept":16,"merged":[[0,1,0,4],[1,1,1,4],[2,1,2,4],[3,1,3,4],[4,1,4,4],[6,1,6,4]]}
[]
[null,{"$f":"'5.CPJ'!B2:E2","v":"PT YESCOM PRATAMA"}]
[null,"RECAPITULATION OF GENERAL JOURNAL"]
[null,"Month : December 2020"]
[null,"(in rupiahs)"]
[]
[null,"RECAPITULATION"]
[null,"ACC. NO","DEBIT","ACC. NO","CREDIT"]
[]
[]
{"$rows_left_out":7}
{"sheet":"7.PCJ","index":8,"n_rows":17,"n_cols":5,"rows_kept":17,"hidden":true,"merged":[[0,1,0,4],[1,1,1,4],[2,1,2,4],[3,1,3,4],[4,1,4,4],[6,1,6,4]]}
[]
[null,{"$f":"'5.CPJ'!B2:E2","v":"PT YESCOM PRATAMA"}]
[null,"PETTY CASH BOOK"]
[null,"Month : December 2020"]
[null,"(in rupiahs)"]
[]
[null,"RECAPITULATION"]
[null,"ACC. NO","DEBIT","ACC. NO","CREDIT"]
[]
[]
{"$rows_left_out":8}
{"sheet":"GENERAL LEDGER","index":9,"n_rows":614,"n_cols":9,"rows_kept":614,"merged":[[1,1,1,8],[2,1,2,8],[3,1,3,8],[4,1,4,8],[7,1,8,2],[7,3,8,3],[7,4,8,4],[7,5,8,5],[7,6,8,6],[7,7,7,8],[18,1,19,2],[18,3,19,3],[18,4,19,4],[18,5,19,5],[18,6,19,6],[18,7,18,8],[29,1,30,2],[29,3,30,3],[29,4,30,4],[29,5,30,5],[29,6,30,6],[29,7,29,8],[40,1,41,2],[40,3,41,3],[40,4,41,4],[40,5,41,5],[40,6,41,6],[40,7,40,8],[51,1,52,2],[51,3,52,3],[51,4,52,4],[51,5,52,5],[51,6,52,6],[51,7,51,8],[62,1,63,2],[62,3,63,3],[62,4,63,4],[62,5,63,5],[62,6,63,6],[62,7,62,8],[73,1,74,2],[73,3,74,3],[73,4,74,4],[73,5,74,5],[73,6,74,6],[73,7,73,8],[84,1,85,2],[84,3,85,3],[84,4,85,4],[84,5,85,5],[84,6,85,6],[84,7,84,8],[95,1,96,2],[95,3,96,3],[95,4,96,4],[95,5,96,5],[95,6,96,6],[95,7,95,8],[106,1,107,2],[106,3,107,3],[106,4,107,4],[106,5,107,5],[106,6,107,6],[106,7,106,8],[117,1,118,2],[117,3,118,3],[117,4,118,4],[117,5,118,5],[117,6,118,6],[117,7,117,8],[128,1,129,2],[128,3,129,3],[128,4,129,4],[128,5,129,5],[128,6,129,6],[128,7,128,8],[139,1,140,2],[139,3,140,3],[139,4,140,4],[139,5,140,5],[139,6,140,6],[139,7,139,8],[150,1,151,2],[150,3,151,3],[150,4,151,4],[150,5,151,5],[150,6,151,6],[150,7,150,8],[161,1,162,2],[161,3,162,3],[161,4,162,4],[161,5,162,5],[161,6,162,6],[161,7,161,8],[172,1,173,2],[172,3,173,3],[172,4,173,4],[172,5,173,5],[172,6,173,6],[172,7,172,8],[183,1,184,2],[183,3,184,3],[183,4,184,4],[183,5,184,5],[183,6,184,6],[183,7,183,8],[194,1,195,2],[194,3,195,3],[194,4,195,4],[194,5,195,5],[194,6,195,6],[194,7,194,8],[205,1,206,2],[205,3,206,3],[205,4,206,4],[205,5,206,5],[205,6,206,6],[205,7,205,8],[216,1,217,2],[216,3,217,3],[216,4,217,4],[216,5,217,5],[216,6,217,6],[216,7,216,8],[227,1,228,2],[227,3,228,3],[227,4,228,4],[227,5,228,5],[227,6,228,6],[227,7,227,8],[238,1,239,2],[238,3,239,3],[238,4,239,4],[238,5,239,5],[238,6,239,6],[238,7,238,8],[249,1,250,2],[249,3,250,3],[249,4,250,4],[249,5,250,5],[249,6,250,6],[249,7,249,8],[260,1,261,2],[260,3,261,3],[260,4,261,4],[260,5,261,5],[260,6,261,6],[260,7,260,8],[271,1,272,2],[271,3,272,3],[271,4,272,4],[271,5,272,5],[271,6,272,6],[271,7,271,8],[282,1,283,2],[282,3,283,3],[282,4,283,4],[282,5,283,5],[282,6,283,6],[282,7,282,8],[293,1,294,2],[293,3,294,3],[293,4,294,4],[293,5,294,5],[293,6,294,6],[293,7,293,8],[304,1,305,2],[304,3,305,3],[304,4,305,4],[304,5,305,5],[304,6,305,6],[304,7,304,8],[315,1,316,2],[315,3,316,3],[315,4,316,4],[315,5,316,5],[315,6,316,6],[315,7,315,8],[326,1,327,2],[326,3,327,3],[326,4,327,4],[326,5,327,5],[326,6,327,6],[326,7,326,8],[337,1,338,2],[337,3,338,3],[337,4,338,4],[337,5,338,5],[337,6,338,6],[337,7,337,8],[348,1,349,2],[348,3,349,3],[348,4,349,4],[348,5,349,5],[348,6,349,6],[348,7,348,8],[359,1,360,2],[359,3,360,3],[359,4,360,4],[359,5,360,5],[359,6,360,6],[359,7,359,8],[370,1,371,2],[370,3,371,3],[370,4,371,4],[370,5,371,5],[370,6,371,6],[370,7,370,8],[381,1,382,2],[381,3,382,3],[381,4,382,4],[381,5,382,5],[381,6,382,6],[381,7,381,8],[392,1,393,2],[392,3,393,3],[392,4,393,4],[392,5,393,5],[392,6,393,6],[392,7,392,8],[403,1,404,2],[403,3,404,3],[403,4,404,4],[403,5,404,5],[403,6,404,6],[403,7,403,8],[414,1,415,2],[414,3,415,3],[414,4,415,4],[414,5,415,5],[414,6,415,6],[414,7,414,8],[425,1,426,2],[425,3,426,3],[425,4,426,4],[425,5,426,5],[425,6,426,6],[425,7,425,8],[436,1,437,2],[436,3,437,3],[436,4,437,4],[436,5,437,5],[436,6,437,6],[436,7,436,8],[447,1,448,2],[447,3,448,3],[447,4,448,4],[447,5,448,5],[447,6,448,6],[447,7,447,8],[458,1,459,2],[458,3,459,3],[458,4,459,4],[458,5,459,5],[458,6,459,6],[458,7,458,8],[469,1,470,2],[469,3,470,3],[469,4,470,4],[469,5,470,5],[469,6,470,6],[469,7,469,8],[480,1,481,2],[480,3,481,3],[480,4,481,4],[480,5,481,5],[480,6,481,6],[480,7,480,8],[491,1,492,2],[491,3,492,3],[491,4,492,4],[491,5,492,5],[491,6,492,6],[491,7,491,8],[502,1,503,2],[502,3,503,3],[502,4,503,4],[502,5,503,5],[502,6,503,6],[502,7,502,8],[513,1,514,2],[513,3,514,3],[513,4,514,4],[513,5,514,5],[513,6,514,6],[513,7,513,8],[524,1,525,2],[524,3,525,3],[524,4,525,4],[524,5,525,5],[524,6,525,6],[524,7,524,8],[535,1,536,2],[535,3,536,3],[535,4,536,4],[535,5,536,5],[535,6,536,6],[535,7,535,8],[546,1,547,2],[546,3,547,3],[546,4,547,4],[546,5,547,5],[546,6,547,6],[546,7,546,8],[557,1,558,2],[557,3,558,3],[557,4,558,4],[557,5,558,5],[557,6,558,6],[557,7,557,8],[568,1,569,2],[568,3,569,3],[568,4,569,4],[568,5,569,5],[568,6,569,6],[568,7,568,8],[579,1,580,2],[579,3,580,3],[579,4,580,4],[579,5,580,5],[579,6,580,6],[579,7,579,8],[590,1,591,2],[590,3,591,3],[590,4,591,4],[590,5,591,5],[590,6,591,6],[590,7,590,8],[601,1,602,2],[601,3,602,3],[601,4,602,4],[601,5,602,5],[601,6,602,6],[601,7,601,8]]}
[]
[null,{"$f":"'6.GJ'!B2:E2","v":"PT YESCOM PRATAMA"}]
[null,"GENERAL LEDGER"]
[null,{"$f":"'6.GJ'!B4:E4","v":"Month : December 2020"}]
[null,"(in rupiahs)"]
[]
[null,"ACCOUNT :",null,{"$f":"VLOOKUP(I7,ACCOUNT!$B$7:$C$69,2)","v":"Cash In Bank"},{"$f":"IF(H10=0,\"K\",IF(I10=0,\"D\",\" \"))","v":"K"},null,null,"ACCOUNT NO. :",{"$f":"'1. TB'!B8","v":"1-1110"}]
[null,"DATE",null,"DESCRIPTION","P/R","DEBIT","CREDIT","BALANCE"]
[{"$nulls":7},"DEBIT","CREDIT"]
[null,"Dec",31,"Beginning Balance",{"$nulls":3},{"$f":"VLOOKUP(I7,'1. TB'!$B$8:$E$62,3)","v":0},{"$f":"VLOOKUP(I7,'1. TB'!$B$8:$E$62,4)","v":0}]
{"$rows_left_out":605}
{"sheet":"UTB","index":10,"n_rows":64,"n_cols":5,"rows_kept":64,"merged":[[1,1,1,4],[2,1,2,4],[3,1,3,4],[5,1,6,1],[5,2,6,2],[5,3,5,4],[63,1,63,2]]}
[]
[null,{"$f":"'GENERAL LEDGER'!B2:I2","v":"PT YESCOM PRATAMA"}]
[null,"UNADJUSTED TRIAL BALANCE"]
[null,"At as December, 31 2020"]
[]
[null,"ACC. NO","ACCOUNT NAME","AMOUNT"]
[{"$nulls":3},"DEBIT","CREDIT"]
[null,{"$f":"'1. TB'!B8","v":"1-1110"},{"$f":"'1. TB'!C8","v":"Cash In Bank"},{"$f":"VLOOKUP(B8,'GENERAL LEDGER'!$B$10:$I$610,7,0)","v":0},{"$f":"VLOOKUP(B8,'GENERAL LEDGER'!$B$10:$I$610,8,0)","v":0}]
[null,{"$f":"'1. TB'!B9","v":"1-1120"},{"$f":"'1. TB'!C9","v":"Petty Cash"},{"$f":"VLOOKUP(B9,'GENERAL LEDGER'!$B$10:$I$610,7,0)","v":0},{"$f":"VLOOKUP(B9,'GENERAL LEDGER'!$B$10:$I$610,8,0)","v":0}]
[null,{"$f":"'1. TB'!B10","v":"1-1130"},{"$f":"'1. TB'!C10","v":"ShopeePay Cash"},{"$f":"VLOOKUP(B10,'GENERAL LEDGER'!$B$10:$I$610,7,0)","v":0},{"$f":"VLOOKUP(B10,'GENERAL LEDGER'!$B$10:$I$610,8,0)","v":0}]
{"$rows_left_out":55}
{"sheet":"7.ADJ","index":11,"n_rows":34,"n_cols":10,"rows_kept":34,"merged":[[1,1,1,9],[2,1,2,9],[3,1,3,9],[4,1,4,9],[5,4,5,8],[6,1,7,2],[6,3,7,3],[6,4,7,6],[6,8,7,8],[6,9,7,9],[28,1,28,7],[29,1,29,7]]}
[]
[null,{"$f":"UTB!B2:E2","v":"PT YESCOM PRATAMA"}]
[null,"GENERAL JOURNAL (ADJUSTMENT)"]
[null,{"$f":"UTB!B4","v":"At as December, 31 2020"}]
[null,"(in rupiahs)"]
[]
[null,"DATE",null,"EVIDENCE NUMBER","DESCRIPTION",null,null,"POST","DEBIT","CREDIT"]
[{"$nulls":7},"REF"]
[null,"Dec",31,"MM-12/02","Depreciation Expense",null,null,"6-1700"]
[null,2020,{"$nulls":3},"Building Accum Dep.",null,"1-3202"]
{"$rows_left_out":25}
{"sheet":"WS","index":12,"n_rows":71,"n_cols":13,"rows_kept":71,"merged":[[1,1,1,12],[2,1,2,12],[3,1,3,12],[4,1,4,12],[6,1,7,1],[6,2,7,2],[6,3,6,4],[6,5,6,6],[6,7,6,8],[6,9,6,10],[6,11,6,12]]}
[]
[null,{"$f":"'7.ADJ'!B2:J2","v":"PT YESCOM PRATAMA"}]
[null,"WORK SHEET"]
[null,"For Month Ended December 31, 2020"]
[null,"(in rupiahs)"]
[{"$nulls":11},"Page : 1"]
[null,"ACC. NO.","ACCOUNT NAME","UNADJUSTED TRIAL BALANCE",null,"ADJUSTMENTS",null,"ADJUSTED TRIAL BALANCE",null,"INCOME STATEMENT",null,"BALANCE SHEET"]
[{"$nulls":3},"DEBIT","CREDIT","DEBIT","CREDIT","DEBIT","CREDIT","DEBIT","CREDIT","DEBIT","CREDIT"]
[null,{"$f":"'1. TB'!B8","v":"1-1110"},{"$f":"'1. TB'!C8","v":"Cash In Bank"},{"$f":"VLOOKUP(B9,UTB!$B$8:$E$62,3,0)","v":0},{"$f":"VLOOKUP(B9,UTB!$B$8:$E$62,4,0)","v":0},{"$f":"SUMIF('7.ADJ'!$H$9:$H$28,WS!B9,'7.ADJ'!$I$9:$I$28)","v":0},{"$f":"SUMIF('7.ADJ'!$H$9:$H$28,WS!B9,'7.ADJ'!$J$9:$J$28)","v":0},{"$f":"IF(D9+F9>E9+G9,D9+F9-G9,0)","v":0},{"$f":"IF(E9+G9>D9+F9,E9+G9-F9,0)","v":0},{"$f":"IF(B9:B35>=\"4-1000\",H9:H35,0)","v":0},{"$f":"IF(B9:B35>=\"4-1000\",I9:I35,0)","v":0},{"$f":"IF(B9:B35<\"4-1000\",H9:H35,0)","v":0},{"$f":"IF(B9:B35<\"4-1000\",I9:I35,0)","v":0}]
[null,{"$f":"'1. TB'!B9","v":"1-1120"},{"$f":"'1. TB'!C9","v":"Petty Cash"},{"$f":"VLOOKUP(B10,UTB!$B$8:$E$62,3,0)","v":0},{"$f":"VLOOKUP(B10,UTB!$B$8:$E$62,4,0)","v":0},{"$f":"SUMIF('7.ADJ'!$H$9:$H$28,WS!B10,'7.ADJ'!$I$9:$I$28)","v":0},{"$f":"SUMIF('7.ADJ'!$H$9:$H$28,WS!B10,'7.ADJ'!$J$9:$J$28)","v":0},{"$f":"IF(D10+F10>E10+G10,D10+F10-G10,0)","v":0},{"$f":"IF(E10+G10>D10+F10,E10+G10-F10,0)","v":0},{"$f":"IF(B10:B36>=\"4-1000\",H10:H36,0)","v":0},{"$f":"IF(B10:B36>=\"4-1000\",I10:I36,0)","v":0},{"$f":"IF(B10:B36<\"4-1000\",H10:H36,0)","v":0},{"$f":"IF(B10:B36<\"4-1000\",I10:I36,0)","v":0}]
{"$rows_left_out":62}
{"sheet":"8.IS","index":13,"n_rows":53,"n_cols":6,"rows_kept":53,"merged":[[1,1,1,5],[2,1,2,5],[3,1,3,5],[4,1,4,5],[5,1,5,2],[5,3,5,5],[47,1,47,2]]}
[]
[null,{"$f":"WS!B2","v":"PT YESCOM PRATAMA"}]
[null,"INCOME STATEMENT"]
[null,"For Year Ended December 31, 2020"]
[]
[null,"DESCRIPTION",null,"AMOUNT"]
[null,"Sales :"]
[null,null,"Sales of Merchandise"]
[null,null,"Sales Discount"]
[null,null,"Sales Return"]
{"$rows_left_out":44}
{"sheet":"9.K-F","index":14,"n_rows":59,"n_cols":8,"rows_kept":59,"hidden":true,"merged":[[1,2,1,7],[2,2,2,7],[3,2,3,7],[4,2,4,7],[5,2,6,3],[5,4,6,4],[5,5,5,6],[5,7,6,7],[49,2,49,3],[50,2,50,3]]}
[]
[null,null,{"$f":"WS!B2","v":"PT YESCOM PRATAMA"}]
[null,null,"FISCAL RECONSILIATION"]
[null,null,"For Year Ended December 31, 2020"]
[]
[null,null,"DESCRIPTION",null,"ACCOUNTING","FISCAL RECONSILIATION",null,"FISCAL"]
[{"$nulls":5},"POSITIVE","NEGATIVE"]
[null,null,"Sales :"]
[{"$nulls":3},{"$f":"'8.IS'!C8","v":"Sales of Merchandise"},{"$f":"'8.IS'!D8","v":0},null,null,{"$f":"E9","v":0}]
[{"$nulls":3},{"$f":"'8.IS'!C9","v":"Sales Discount"},{"$f":"'8.IS'!D9","v":0},null,null,{"$f":"E10","v":0}]
{"$rows_left_out":50}
{"sheet":"10. IS-FISCAL","index":15,"n_rows":56,"n_cols":7,"rows_kept":56,"hidden":true,"merged":[[1,2,1,6],[2,2,2,6],[3,2,3,6],[4,2,4,6],[5,2,5,3],[5,4,5,6],[50,2,50,3]]}
[]
[null,null,{"$f":"WS!B2","v":"PT YESCOM PRATAMA"}]
[null,null,"FISCAL - INCOME STATEMENT"]
[null,null,"For Year Ended December 31, 2019"]
[]
[null,null,"DESCRIPTION",null,"AMOUNT"]
[null,null,"Sales :"]
[{"$nulls":3},{"$f":"'8.IS'!C8","v":"Sales of Merchandise"},{"$f":"'9.K-F'!H9","v":0}]
[{"$nulls":3},{"$f":"'8.IS'!C9","v":"Sales Discount"},{"$f":"'9.K-F'!H10","v":0}]
[{"$nulls":3},{"$f":"'8.IS'!C11","v":"Freight Collected"},{"$f":"'9.K-F'!H11","v":0}]
{"$rows_left_out":47}
{"sheet":"9.SE","index":16,"n_rows":18,"n_cols":4,"rows_kept":18,"merged":[[1,1,1,3],[2,1,2,3],[3,1,3,3]]}
[]
[null,{"$f":"'8.IS'!B2","v":"PT YESCOM PRATAMA"}]
[null,"STATEMENT OF RETAINED EARNING'S"]
[null,"For Month Ended December 31, 2020"]
[]
[null,"Retained Earning's, November 30, 2020"]
[]
[null,null,"Plus Net Profit"]
[]
[null,null,"Less Cash Devidend Declared"]
{"$rows_left_out":9}
{"sheet":"10. FPR","index":17,"n_rows":38,"n_cols":9,"rows_kept":38,"merged":[[1,1,1,8],[2,1,2,8],[3,1,3,8],[4,1,4,8],[5,1,5,3],[5,7,5,8],[6,1,6,4],[6,5,6,8]]}
[]
[null,{"$f":"'9.SE'!B2","v":"PT YESCOM PRATAMA"}]
[null,"FINANCIAL POSITION REPORT"]
[null,"December 31, 2020"]
[]
[null,"ASSETS",{"$nulls":5},"LIABILITIES AND STOCKHOLDER'S EQUITY"]
[null,"CURRENT ASSETS",{"$nulls":3},"LIABILITIES"]
[null,null,"Cash In Bank",{"$nulls":3},"CURRENT LIABILITIES"]
[null,null,"Petty Cash",{"$nulls":4},"Accounts Payable"]
[null,null,"ShopeePay Cash",{"$nulls":4},"Accrued Expense"]
{"$rows_left_out":29}
{"sheet":"11.CF","index":18,"n_rows":49,"n_cols":6,"rows_kept":49,"merged":[[0,0,0,5],[1,0,1,5],[2,0,2,5],[3,0,3,5],[19,1,19,2],[28,1,28,2],[37,1,37,2]]}
[{"$f":"'13. POST CLOSING TB'!B2","v":"PT YESCOM PRATAMA"}]
["STATEMENT OF CASH FLOW "]
["For the Year Ended December 31, 2020"]
["(Direct Method)"]
[]
[null,"CASH FLOWS FROM OPERATING ACTIVITIES:"]
[null,"Cash In"]
[null,null,"Receive Payment from Customer"]
[null,null,"Sales via Shopee"]
[null,null,"Total",null,{"$f":"SUM(D8:D9)","v":0}]
{"$rows_left_out":40}
{"sheet":"12. CLOSING","index":19,"n_rows":47,"n_cols":10,"rows_kept":47,"merged":[[1,1,1,9],[2,1,2,9],[3,1,3,9],[4,1,4,9],[5,5,5,8],[6,1,6,2],[6,4,6,6]]}
[]
[null,{"$f":"'10. FPR'!B2","v":"PT YESCOM PRATAMA"}]
[null,"GENERAL JOURNAL (CLOSING)"]
[null,{"$f":"'9.SE'!B4:D4","v":"For Month Ended December 31, 2020"}]
[null,"(in Rupiahs)"]
[{"$nulls":9},"Page :  1"]
[null,"DATE",null,"EVIDENCE NO.","DESCRIPTION",null,null,"POST REF","DEBIT","CREDIT"]
[null,"Dec",31,null,{"$f":"VLOOKUP(H8,WS!$B$9:$M$67,2,0)","v":"Sales of Merchandise"},null,null,"4-1100"]
[{"$nulls":4},{"$f":"VLOOKUP(H9,WS!$B$9:$M$67,2,0)","v":"Freight Collected"},null,null,"4-1400"]
[{"$nulls":4},{"$f":"VLOOKUP(H10,WS!$B$9:$M$67,2,0)","v":"Late Fees Collected"},null,null,"4-1500"]
{"$rows_left_out":38}
{"sheet":"13. POST CLOSING TB","index":20,"n_rows":42,"n_cols":5,"rows_kept":42,"merged":[[1,1,1,4],[2,1,2,4],[3,1,3,4],[5,1,6,1],[5,2,6,2],[5,3,5,4],[36,1,36,2]]}
[]
[null,{"$f":"'12. CLOSING'!B2","v":"PT YESCOM PRATAMA"}]
[null,"POST CLOSING TRIAL BALANCE"]
[null,"December 31, 2020"]
[]
[null,"ACC. NO","ACCOUNT NAME","AMOUNT"]
[{"$nulls":3},"DEBIT","CREDIT"]
[null,{"$f":"'1. TB'!B8","v":"1-1110"},{"$f":"'1. TB'!C8","v":"Cash In Bank"}]
[null,{"$f":"'1. TB'!B9","v":"1-1120"},{"$f":"'1. TB'!C9","v":"Petty Cash"}]
[null,{"$f":"'1. TB'!B10","v":"1-1130"},{"$f":"'1. TB'!C10","v":"ShopeePay Cash"}]
{"$rows_left_out":32}